Target
Disintegrin and metalloproteinase domain-containing protein 10
Ligand
BDBM113952
Substrate
Meas. Tech.
QFRET-based biochemical high throughput dose response assay to identify exosite inhibitors of ADAM10.
IC50
7587±n/a nM
Citation
 PubChem, PC QFRET-based biochemical high throughput dose response assay to identify exosite inhibitors of ADAM10. PubChem Bioassay (2014)[AID] 
Target
Name:
Disintegrin and metalloproteinase domain-containing protein 10
Synonyms:
ADA10_HUMAN Disintegrin and metalloproteinase domain-containing protein 10 (ADAM10) MADM
Type:
Enzyme
Mol. Mass.:
84160.93
Organism:
Homo sapiens (Human)
Description:
O14672
Residue:
748
  
Inhibitor
Name:
BDBM113952
Synonyms:
1-(3,4-difluorophenyl)-1-[4-[3-(trifluoromethyl)phenyl]-1,3-thiazol-2-yl]ethanol 1-(3,4-difluorophenyl)-1-[4-[3-(trifluoromethyl)phenyl]thiazol-2-yl]ethanol MLS003122754 cid_46942956
Type:
Small organic molecule
Emp. Form.:
C18H12F5NOS
Mol. Mass.:
385.351
SMILES:
CC(O)(c1nc(cs1)-c1cccc(c1)C(F)(F)F)c1ccc(F)c(F)c1
: