Target
Disintegrin and metalloproteinase domain-containing protein 17
Ligand
BDBM34807
Substrate
Meas. Tech.
QFRET-based biochemical high throughput dose response assay to identify exosite inhibitors of ADAM17
IC50
31208±n/a nM
Citation
 PubChem, PC QFRET-based biochemical high throughput dose response assay to identify exosite inhibitors of ADAM17 PubChem Bioassay (2014)[AID] 
Target
Name:
Disintegrin and metalloproteinase domain-containing protein 17
Synonyms:
ADA17_HUMAN CSVP Disintegrin and metalloproteinase domain-containing protein 17 (ADAM17) TNF-alpha convertase TNF-alpha-converting enzyme (TACE) Tumor necrosis factor-α converting enzyme (TACE)
Type:
Enzyme
Mol. Mass.:
93007.89
Organism:
Homo sapiens (Human)
Description:
Residue:
824
  
Inhibitor
Name:
BDBM34807
Synonyms:
(4E)-2,3-bis(oxidanyl)-4-[[(2-propan-2-ylimino-4-thiophen-2-yl-1,3-thiazol-3-yl)amino]methylidene]cyclohexa-2,5-dien-1-one (4E)-2,3-dihydroxy-4-[[(2-propan-2-ylimino-4-thiophen-2-yl-3-thiazolyl)amino]methylidene]-1-cyclohexa-2,5-dienone MLS000417071 cid_5882673
Type:
Small organic molecule
Emp. Form.:
C17H17N3O3S2
Mol. Mass.:
375.465
SMILES:
CC(C)N=c1scc(-c2cccs2)n1N=Cc1ccc(O)c(O)c1O
: