Target
Disintegrin and metalloproteinase domain-containing protein 17
Ligand
BDBM114065
Substrate
Meas. Tech.
QFRET-based biochemical high throughput dose response assay to identify exosite inhibitors of ADAM17
IC50
69489±n/a nM
Citation
 PubChem, PC QFRET-based biochemical high throughput dose response assay to identify exosite inhibitors of ADAM17 PubChem Bioassay (2014)[AID] 
Target
Name:
Disintegrin and metalloproteinase domain-containing protein 17
Synonyms:
ADA17_HUMAN CSVP Disintegrin and metalloproteinase domain-containing protein 17 (ADAM17) TNF-alpha convertase TNF-alpha-converting enzyme (TACE) Tumor necrosis factor-α converting enzyme (TACE)
Type:
Enzyme
Mol. Mass.:
93007.89
Organism:
Homo sapiens (Human)
Description:
Residue:
824
  
Inhibitor
Name:
BDBM114065
Synonyms:
2-(3-chlorophenyl)-N-[3-(dimethylsulfamoyl)phenyl]-5-(2-thienyl)pyrazole-3-carboxamide 2-(3-chlorophenyl)-N-[3-(dimethylsulfamoyl)phenyl]-5-thiophen-2-yl-pyrazole-3-carboxamide MLS000402283 cid_4333298
Type:
Small organic molecule
Emp. Form.:
C22H19ClN4O3S2
Mol. Mass.:
486.994
SMILES:
CN(C)S(=O)(=O)c1cccc(NC(=O)c2cc(nn2-c2cccc(Cl)c2)-c2cccs2)c1
: