Target
Disintegrin and metalloproteinase domain-containing protein 17
Ligand
BDBM88675
Substrate
Meas. Tech.
QFRET-based biochemical high throughput dose response assay to identify exosite inhibitors of ADAM17
IC50
69483±n/a nM
Citation
 PubChem, PC QFRET-based biochemical high throughput dose response assay to identify exosite inhibitors of ADAM17 PubChem Bioassay (2014)[AID] 
Target
Name:
Disintegrin and metalloproteinase domain-containing protein 17
Synonyms:
ADA17_HUMAN CSVP Disintegrin and metalloproteinase domain-containing protein 17 (ADAM17) TNF-alpha convertase TNF-alpha-converting enzyme (TACE) Tumor necrosis factor-α converting enzyme (TACE)
Type:
Enzyme
Mol. Mass.:
93007.89
Organism:
Homo sapiens (Human)
Description:
Residue:
824
  
Inhibitor
Name:
BDBM88675
Synonyms:
MLS002693509 N-[[4-[bis(2-chloroethyl)amino]phenyl]methylideneamino]-2-(1H-indol-3-yl)-2-oxidanylidene-ethanamide SMR001559460 | cid_248413
Type:
Small organic molecule
Emp. Form.:
C21H20Cl2N4O2
Mol. Mass.:
431.315
SMILES:
ClCCN(CCCl)c1ccc(C=NNC(=O)C(=O)c2c[nH]c3ccccc23)cc1
: