Target
Tyrosyl-DNA phosphodiesterase 2
Ligand
BDBM42209
Substrate
Meas. Tech.
Epi Absorbance-based biochemical high throughput dose response assay to identify inhibitors of human tyrosyl-DNA phosphodiesterase 2 (TDP2)
IC50
5361±n/a nM
Citation
 PubChem, PC Epi Absorbance-based biochemical high throughput dose response assay to identify inhibitors of human tyrosyl-DNA phosphodiesterase 2 (TDP2) PubChem Bioassay (2014)[AID] 
Target
Name:
Tyrosyl-DNA phosphodiesterase 2
Synonyms:
EAP2 ETS1-associated protein 2 TDP2 TTRAP Tyr-DNA phosphodiesterase 2 Tyrosyl-DNA phosphodiesterase 2 (hTDP2) VPg unlinkase | hTDP2
Type:
Enzyme Catalytic Domain
Mol. Mass.:
40916.54
Organism:
Homo sapiens (Human)
Description:
gi_23510348
Residue:
362
  
Inhibitor
Name:
BDBM42209
Synonyms:
MLS000532824 N-[(1,3-diketoindan-2-ylidene)amino]benzamide N-[(1,3-dioxoinden-2-ylidene)amino]benzamide SMR000140262 | cid_871656
Type:
Small organic molecule
Emp. Form.:
C16H10N2O3
Mol. Mass.:
278.2622
SMILES:
O=C(NN=c1c(=O)c2ccccc2c1=O)c1ccccc1
: