Target
Tyrosyl-DNA phosphodiesterase 2
Ligand
BDBM70879
Substrate
Meas. Tech.
Epi Absorbance-based biochemical high throughput dose response assay to identify inhibitors of human tyrosyl-DNA phosphodiesterase 2 (TDP2)
IC50
527.96±n/a nM
Citation
 PubChem, PC Epi Absorbance-based biochemical high throughput dose response assay to identify inhibitors of human tyrosyl-DNA phosphodiesterase 2 (TDP2) PubChem Bioassay (2014)[AID] 
Target
Name:
Tyrosyl-DNA phosphodiesterase 2
Synonyms:
EAP2 ETS1-associated protein 2 TDP2 TTRAP Tyr-DNA phosphodiesterase 2 Tyrosyl-DNA phosphodiesterase 2 (hTDP2) VPg unlinkase | hTDP2
Type:
Enzyme Catalytic Domain
Mol. Mass.:
40916.54
Organism:
Homo sapiens (Human)
Description:
gi_23510348
Residue:
362
  
Inhibitor
Name:
BDBM70879
Synonyms:
4-[bis(5-hydroxy-3-methyl-1-phenyl-1H-pyrazol-4-yl)methyl]benzoic acid 4-[bis(5-methyl-3-oxidanylidene-2-phenyl-1H-pyrazol-4-yl)methyl]benzoic acid MLS000704754 cid_4390439
Type:
Small organic molecule
Emp. Form.:
C28H24N4O4
Mol. Mass.:
480.5146
SMILES:
Cc1[nH]n(-c2ccccc2)c(=O)c1C(c1c(C)[nH]n(-c2ccccc2)c1=O)c1ccc(cc1)C(O)=O
: