Target
Tyrosyl-DNA phosphodiesterase 2
Ligand
BDBM91515
Substrate
Meas. Tech.
Epi Absorbance-based biochemical high throughput dose response assay to identify inhibitors of human tyrosyl-DNA phosphodiesterase 2 (TDP2)
IC50
5986±n/a nM
Citation
 PubChem, PC Epi Absorbance-based biochemical high throughput dose response assay to identify inhibitors of human tyrosyl-DNA phosphodiesterase 2 (TDP2) PubChem Bioassay (2014)[AID] 
Target
Name:
Tyrosyl-DNA phosphodiesterase 2
Synonyms:
EAP2 ETS1-associated protein 2 TDP2 TTRAP Tyr-DNA phosphodiesterase 2 Tyrosyl-DNA phosphodiesterase 2 (hTDP2) VPg unlinkase | hTDP2
Type:
Enzyme Catalytic Domain
Mol. Mass.:
40916.54
Organism:
Homo sapiens (Human)
Description:
gi_23510348
Residue:
362
  
Inhibitor
Name:
BDBM91515
Synonyms:
8-aminoquinoline-5,6-dione 8-azanylquinoline-5,6-dione SMR001797657 | cid_279596
Type:
Small organic molecule
Emp. Form.:
C9H6N2O2
Mol. Mass.:
174.1561
SMILES:
NC1=CC(=O)C(=O)c2cccnc12
: