Target
1-phosphatidylinositol 4,5-bisphosphate phosphodiesterase beta-3
Ligand
BDBM114234
Substrate
Meas. Tech.
Fluorescence-based biochemical high throughput dose response assay to identify inhibitors of phospholipase C isozymes (PLC-B3)
IC50
122440±n/a nM
Citation
 PubChem, PC Fluorescence-based biochemical high throughput dose response assay to identify inhibitors of phospholipase C isozymes (PLC-B3) PubChem Bioassay (2014)[AID] 
Target
Name:
1-phosphatidylinositol 4,5-bisphosphate phosphodiesterase beta-3
Synonyms:
PLCB3 Phospholipase C, beta 3 (phosphatidylinositol-specific) | Phospholipase C-beta-3
Type:
PROTEIN
Mol. Mass.:
138786.29
Organism:
Homo sapiens (Human)
Description:
EBI_12586
Residue:
1234
  
Inhibitor
Name:
BDBM114234
Synonyms:
4-tert-butyl-N-phenyl-1-cyclohexanecarboxamide 4-tert-butyl-N-phenyl-cyclohexanecarboxamide MLS000536601 cid_2118495
Type:
Small organic molecule
Emp. Form.:
C17H25NO
Mol. Mass.:
259.3865
SMILES:
CC(C)(C)C1CCC(CC1)C(=O)Nc1ccccc1
: