Target
1-phosphatidylinositol 4,5-bisphosphate phosphodiesterase beta-3
Ligand
BDBM50629
Substrate
Meas. Tech.
Fluorescence-based biochemical high throughput dose response assay to identify inhibitors of phospholipase C isozymes (PLC-B3)
IC50
122562±n/a nM
Citation
 PubChem, PC Fluorescence-based biochemical high throughput dose response assay to identify inhibitors of phospholipase C isozymes (PLC-B3) PubChem Bioassay (2014)[AID] 
Target
Name:
1-phosphatidylinositol 4,5-bisphosphate phosphodiesterase beta-3
Synonyms:
PLCB3 Phospholipase C, beta 3 (phosphatidylinositol-specific) | Phospholipase C-beta-3
Type:
PROTEIN
Mol. Mass.:
138786.29
Organism:
Homo sapiens (Human)
Description:
EBI_12586
Residue:
1234
  
Inhibitor
Name:
BDBM50629
Synonyms:
(5Z)-5-[(E)-3-(2-furanyl)prop-2-enylidene]-3-(4-hydroxyphenyl)-2-sulfanylidene-4-thiazolidinone (5Z)-5-[(E)-3-(furan-2-yl)prop-2-enylidene]-3-(4-hydroxyphenyl)-2-sulfanylidene-1,3-thiazolidin-4-one MLS000778636 cid_6241261
Type:
Small organic molecule
Emp. Form.:
C16H11NO3S2
Mol. Mass.:
329.393
SMILES:
Oc1ccc(cc1)N1C(=S)S\C(=C/C=C/c2ccco2)C1=O
: