Target
1-phosphatidylinositol 4,5-bisphosphate phosphodiesterase beta-3
Ligand
BDBM114259
Substrate
Meas. Tech.
Fluorescence-based biochemical high throughput dose response assay to identify inhibitors of phospholipase C isozymes (PLC-B3)
IC50
122487±n/a nM
Citation
 PubChem, PC Fluorescence-based biochemical high throughput dose response assay to identify inhibitors of phospholipase C isozymes (PLC-B3) PubChem Bioassay (2014)[AID] 
Target
Name:
1-phosphatidylinositol 4,5-bisphosphate phosphodiesterase beta-3
Synonyms:
PLCB3 Phospholipase C, beta 3 (phosphatidylinositol-specific) | Phospholipase C-beta-3
Type:
PROTEIN
Mol. Mass.:
138786.29
Organism:
Homo sapiens (Human)
Description:
EBI_12586
Residue:
1234
  
Inhibitor
Name:
BDBM114259
Synonyms:
3-[5-[(E)-(1-ketothiazolo[3,2-a]benzimidazol-2-ylidene)methyl]-2-furyl]benzoic acid 3-[5-[(E)-(1-oxo-2-thiazolo[3,2-a]benzimidazolylidene)methyl]-2-furanyl]benzoic acid 3-{5-[3-Oxo-benzo[4,5]imidazo[2,1-b]thiazol-(2E)-ylidenemethyl]-furan-2-yl}-benzoic acid SMR000413437 cid_1976940
Type:
Small organic molecule
Emp. Form.:
C21H12N2O4S
Mol. Mass.:
388.396
SMILES:
OC(=O)c1cccc(c1)-c1ccc(\C=c2\sc3nc4ccccc4n3c2=O)o1
: