Target
1-phosphatidylinositol 4,5-bisphosphate phosphodiesterase beta-3
Ligand
BDBM114279
Substrate
Meas. Tech.
Fluorescence-based biochemical high throughput dose response assay to identify inhibitors of phospholipase C isozymes (PLC-B3)
IC50
122481±n/a nM
Citation
 PubChem, PC Fluorescence-based biochemical high throughput dose response assay to identify inhibitors of phospholipase C isozymes (PLC-B3) PubChem Bioassay (2014)[AID] 
Target
Name:
1-phosphatidylinositol 4,5-bisphosphate phosphodiesterase beta-3
Synonyms:
PLCB3 Phospholipase C, beta 3 (phosphatidylinositol-specific) | Phospholipase C-beta-3
Type:
PROTEIN
Mol. Mass.:
138786.29
Organism:
Homo sapiens (Human)
Description:
EBI_12586
Residue:
1234
  
Inhibitor
Name:
BDBM114279
Synonyms:
3-[4-(3-chlorophenyl)piperazin-1-yl]sulfonyl-5-nitro-1H-indole 3-[[4-(3-chlorophenyl)-1-piperazinyl]sulfonyl]-5-nitro-1H-indole SMR000627299 | cid_24792808
Type:
Small organic molecule
Emp. Form.:
C18H17ClN4O4S
Mol. Mass.:
420.87
SMILES:
[O-][N+](=O)c1ccc2[nH]cc(c2c1)S(=O)(=O)N1CCN(CC1)c1cccc(Cl)c1
: