Target
1-phosphatidylinositol 4,5-bisphosphate phosphodiesterase beta-3
Ligand
BDBM55038
Substrate
Meas. Tech.
Fluorescence-based biochemical high throughput dose response assay to identify inhibitors of phospholipase C isozymes (PLC-B3)
IC50
122490±n/a nM
Citation
 PubChem, PC Fluorescence-based biochemical high throughput dose response assay to identify inhibitors of phospholipase C isozymes (PLC-B3) PubChem Bioassay (2014)[AID] 
Target
Name:
1-phosphatidylinositol 4,5-bisphosphate phosphodiesterase beta-3
Synonyms:
PLCB3 Phospholipase C, beta 3 (phosphatidylinositol-specific) | Phospholipase C-beta-3
Type:
PROTEIN
Mol. Mass.:
138786.29
Organism:
Homo sapiens (Human)
Description:
EBI_12586
Residue:
1234
  
Inhibitor
Name:
BDBM55038
Synonyms:
(2E,4S,4aR,5S,5aR,12aS)-2-[amino(hydroxy)methylene]-4-(dimethylamino)-5,10,11,12a-tetrahydroxy-6-methylene-4,4a,5,5a-tetrahydrotetracene-1,3,12-trione;hydrochloride (2E,4S,4aR,5S,5aR,12aS)-2-[amino(hydroxy)methylidene]-4-(dimethylamino)-5,10,11,12a-tetrahydroxy-6-methylidene-4,4a,5,5a-tetrahydrotetracene-1,3,12-trione;hydrochloride (4S,4aR,5S,5aR,12aR)-4-(dimethylamino)-1,5,10,11,12a-pentahydroxy-3,12-diketo-6-methylene-4,4a,5,5a-tetrahydrotetracene-2-carboxamide;hydrochloride MLS001049011 SMR000387056 | cid_16196941
Type:
Small organic molecule
Emp. Form.:
C22H22N2O8
Mol. Mass.:
442.4187
SMILES:
CN(C)[C@H]1[C@@H]2[C@@H](O)[C@H]3C(C(=O)c4c(O)cccc4C3=C)C(=O)[C@]2(O)C(=O)C(C(N)=O)C1=O
: