Target
1-phosphatidylinositol 4,5-bisphosphate phosphodiesterase beta-3
Ligand
BDBM114299
Substrate
Meas. Tech.
Fluorescence-based biochemical high throughput dose response assay to identify inhibitors of phospholipase C isozymes (PLC-B3)
IC50
122493±n/a nM
Citation
 PubChem, PC Fluorescence-based biochemical high throughput dose response assay to identify inhibitors of phospholipase C isozymes (PLC-B3) PubChem Bioassay (2014)[AID] 
Target
Name:
1-phosphatidylinositol 4,5-bisphosphate phosphodiesterase beta-3
Synonyms:
PLCB3 Phospholipase C, beta 3 (phosphatidylinositol-specific) | Phospholipase C-beta-3
Type:
PROTEIN
Mol. Mass.:
138786.29
Organism:
Homo sapiens (Human)
Description:
EBI_12586
Residue:
1234
  
Inhibitor
Name:
BDBM114299
Synonyms:
(3R,6S)-1-acetyl-3-(1H-indol-3-yl)-N-(4-methylphenyl)sulfonyl-3,6-dihydro-2H-pyridine-6-carboxamide (3R,6S)-1-ethanoyl-3-(1H-indol-3-yl)-N-(4-methylphenyl)sulfonyl-3,6-dihydro-2H-pyridine-6-carboxamide SMR002530747 | cid_60156651
Type:
Small organic molecule
Emp. Form.:
C23H23N3O4S
Mol. Mass.:
437.511
SMILES:
CC(=O)N1C[C@H](C=C[C@H]1C(=O)NS(=O)(=O)c1ccc(C)cc1)c1c[nH]c2ccccc12
: