Target
Receptor tyrosine-protein kinase erbB-2
Ligand
BDBM4569
Substrate
Receptor tyrosine-protein kinase erbB-2
Meas. Tech.
Kinase Inhibition Assay
IC50
38±n/a nM
Citation
 Tsou, HRMamuya, NJohnson, BDReich, MFGruber, BCYe, FNilakantan, RShen, RDiscafani, CDeBlanc, RDavis, RKoehn, FEGreenberger, LMWang, YFWissner, A 6-Substituted-4-(3-bromophenylamino)quinazolines as putative irreversible inhibitors of the epidermal growth factor receptor (EGFR) and human epidermal growth factor receptor (HER-2) tyrosine kinases with enhanced antitumor activity. J Med Chem 44:2719-34 (2001)  
Target
Name:
Receptor tyrosine-protein kinase erbB-2
Synonyms:
2.7.10.1 CD_antigen=CD340 ERBB2_HUMAN FASN/HER2 HER2 MLN19 NEU Proto-oncogene Neu Tyrosine kinase-type cell surface receptor HER2 | p185erbB2
Type:
Mol. Mass.:
137894.47
Organism:
Homo sapiens (Human)
Description:
P04626
Residue:
1255
  
Inhibitor
Name:
BDBM4569
Synonyms:
4-anilinoquinazoline deriv. 10b | N-{4-[(3-bromophenyl)amino]quinazolin-6-yl}-4-(diethylamino)but-2-ynamide
Type:
Small organic molecule
Emp. Form.:
C22H22BrN5O
Mol. Mass.:
452.347
SMILES:
CCN(CC)CC#CC(=O)Nc1ccc2ncnc(Nc3cccc(Br)c3)c2c1
:
Substrate
Name:
Receptor tyrosine-protein kinase erbB-2
Synonyms:
2.7.10.1 CD_antigen=CD340 ERBB2_HUMAN FASN/HER2 HER2 MLN19 NEU Proto-oncogene Neu Tyrosine kinase-type cell surface receptor HER2 | p185erbB2
Type:
Mol. Mass.:
137894.47
Organism:
Homo sapiens (Human)
Description:
P04626
Residue:
1255