Target
Receptor tyrosine-protein kinase erbB-2
Ligand
BDBM4574
Substrate
Receptor tyrosine-protein kinase erbB-2
Meas. Tech.
Kinase Inhibition Assay
IC50
73±n/a nM
Citation
 Tsou, HRMamuya, NJohnson, BDReich, MFGruber, BCYe, FNilakantan, RShen, RDiscafani, CDeBlanc, RDavis, RKoehn, FEGreenberger, LMWang, YFWissner, A 6-Substituted-4-(3-bromophenylamino)quinazolines as putative irreversible inhibitors of the epidermal growth factor receptor (EGFR) and human epidermal growth factor receptor (HER-2) tyrosine kinases with enhanced antitumor activity. J Med Chem 44:2719-34 (2001)  
Target
Name:
Receptor tyrosine-protein kinase erbB-2
Synonyms:
2.7.10.1 CD_antigen=CD340 ERBB2_HUMAN FASN/HER2 HER2 MLN19 NEU Proto-oncogene Neu Tyrosine kinase-type cell surface receptor HER2 | p185erbB2
Type:
Mol. Mass.:
137894.47
Organism:
Homo sapiens (Human)
Description:
P04626
Residue:
1255
  
Inhibitor
Name:
BDBM4574
Synonyms:
4-anilinoquinazoline deriv. 10g | N-{4-[(3-bromophenyl)amino]quinazolin-6-yl}-4-(piperidin-1-yl)but-2-ynamide
Type:
Small organic molecule
Emp. Form.:
C23H22BrN5O
Mol. Mass.:
464.358
SMILES:
Brc1cccc(Nc2ncnc3ccc(NC(=O)C#CCN4CCCCC4)cc23)c1
:
Substrate
Name:
Receptor tyrosine-protein kinase erbB-2
Synonyms:
2.7.10.1 CD_antigen=CD340 ERBB2_HUMAN FASN/HER2 HER2 MLN19 NEU Proto-oncogene Neu Tyrosine kinase-type cell surface receptor HER2 | p185erbB2
Type:
Mol. Mass.:
137894.47
Organism:
Homo sapiens (Human)
Description:
P04626
Residue:
1255