Target
1-phosphatidylinositol 4,5-bisphosphate phosphodiesterase gamma-1 [1-999,I813T]
Ligand
BDBM114226
Substrate
Meas. Tech.
Counterscreen for inhibitors of phospholipase C isozymes (PLC-B3): Fluorescence-based biochemical high throughput dose response assay to identify inhibitors of phospholipase C isozymes (PLC-gamma1)
IC50
122493±n/a nM
Citation
 PubChem, PC Counterscreen for inhibitors of phospholipase C isozymes (PLC-B3): Fluorescence-based biochemical high throughput dose response assay to identify inhibitors of phospholipase C isozymes (PLC-gamma1) PubChem Bioassay (2014)[AID] 
Target
Name:
1-phosphatidylinositol 4,5-bisphosphate phosphodiesterase gamma-1 [1-999,I813T]
Synonyms:
PLC1 PLCG1_HUMAN | Phospholipase C, gamma 1
Type:
Enzyme Catalytic Domain
Mol. Mass.:
115282.60
Organism:
Homo sapiens (Human)
Description:
gi_223459640
Residue:
999
  
Inhibitor
Name:
BDBM114226
Synonyms:
2-(1,5-Dimethyl-3-oxo-2-phenyl-2,3-dihydro-1H-pyrazol-4-yl)-benzo[de]isoquinoline-1,3-dione 2-(1,5-dimethyl-3-oxo-2-phenyl-4-pyrazolyl)benzo[de]isoquinoline-1,3-dione 2-(3-keto-1,5-dimethyl-2-phenyl-3-pyrazolin-4-yl)benzo[de]isoquinoline-1,3-quinone SMR000120885 | cid_1071270
Type:
Small organic molecule
Emp. Form.:
C23H17N3O3
Mol. Mass.:
383.3994
SMILES:
Cc1c(N2C(=O)c3cccc4cccc(C2=O)c34)c(=O)n(-c2ccccc2)n1C
: