Target
1-phosphatidylinositol 4,5-bisphosphate phosphodiesterase gamma-1 [1-999,I813T]
Ligand
BDBM114297
Substrate
Meas. Tech.
Counterscreen for inhibitors of phospholipase C isozymes (PLC-B3): Fluorescence-based biochemical high throughput dose response assay to identify inhibitors of phospholipase C isozymes (PLC-gamma1)
IC50
2026±n/a nM
Citation
 PubChem, PC Counterscreen for inhibitors of phospholipase C isozymes (PLC-B3): Fluorescence-based biochemical high throughput dose response assay to identify inhibitors of phospholipase C isozymes (PLC-gamma1) PubChem Bioassay (2014)[AID] 
Target
Name:
1-phosphatidylinositol 4,5-bisphosphate phosphodiesterase gamma-1 [1-999,I813T]
Synonyms:
PLC1 PLCG1_HUMAN | Phospholipase C, gamma 1
Type:
Enzyme Catalytic Domain
Mol. Mass.:
115282.60
Organism:
Homo sapiens (Human)
Description:
gi_223459640
Residue:
999
  
Inhibitor
Name:
BDBM114297
Synonyms:
2-[(3R,6S)-1-acetyl-6-(tosylcarbamoyl)-3,6-dihydro-2H-pyridin-3-yl]malonic acid dimethyl ester MLS003874090 cid_60156649 dimethyl 2-[(3R,6S)-1-ethanoyl-6-[(4-methylphenyl)sulfonylcarbamoyl]-3,6-dihydro-2H-pyridin-3-yl]propanedioate
Type:
Small organic molecule
Emp. Form.:
C20H24N2O8S
Mol. Mass.:
452.478
SMILES:
COC(=O)C([C@@H]1CN([C@@H](C=C1)C(=O)NS(=O)(=O)c1ccc(C)cc1)C(C)=O)C(=O)OC
: