Target
Group 3 secretory phospholipase A2
Ligand
BDBM114477
Substrate
Meas. Tech.
QFRET-based biochemical high throughput dose response assay to identify inhibitors of human group III secreted phospholipase A2 enzyme (HGIII-sPLA2)
IC50
43190±n/a nM
Citation
 PubChem, PC QFRET-based biochemical high throughput dose response assay to identify inhibitors of human group III secreted phospholipase A2 enzyme (HGIII-sPLA2) PubChem Bioassay (2014)[AID] 
Target
Name:
Group 3 secretory phospholipase A2
Synonyms:
3.1.1.4 Group III secretory phopholipase A2 PA2G3_HUMAN Phosphatidylcholine 2-acylhydrolase 3 sPLA2-III
Type:
PROTEIN
Mol. Mass.:
57196.58
Organism:
Homo sapiens
Description:
ChEMBL_119722
Residue:
509
  
Inhibitor
Name:
BDBM114477
Synonyms:
3-Methoxy-benzoic acid 4,4,6-trimethyl-1,2-dioxo-1,2-dihydro-4H-pyrrolo[3,2,1-ij]quinolin-8-yl ester SMR000178281 | cid_1620644
Type:
Small organic molecule
Emp. Form.:
C22H19NO5
Mol. Mass.:
377.39
SMILES:
COc1cccc(c1)C(=O)Oc1cc2C(=O)C(=O)N3c2c(c1)C(C)=CC3(C)C
: