Target
Group 3 secretory phospholipase A2
Ligand
BDBM114479
Substrate
Meas. Tech.
QFRET-based biochemical high throughput dose response assay to identify inhibitors of human group III secreted phospholipase A2 enzyme (HGIII-sPLA2)
IC50
51171±n/a nM
Citation
 PubChem, PC QFRET-based biochemical high throughput dose response assay to identify inhibitors of human group III secreted phospholipase A2 enzyme (HGIII-sPLA2) PubChem Bioassay (2014)[AID] 
Target
Name:
Group 3 secretory phospholipase A2
Synonyms:
3.1.1.4 Group III secretory phopholipase A2 PA2G3_HUMAN Phosphatidylcholine 2-acylhydrolase 3 sPLA2-III
Type:
PROTEIN
Mol. Mass.:
57196.58
Organism:
Homo sapiens
Description:
ChEMBL_119722
Residue:
509
  
Inhibitor
Name:
BDBM114479
Synonyms:
(1E)-1-[4-(4-bromophenyl)-3-phenyl-1,3-thiazol-2-ylidene]propan-2-one (1E)-1-[4-(4-bromophenyl)-3-phenyl-4-thiazolin-2-ylidene]acetone MLS000579193 cid_2256906
Type:
Small organic molecule
Emp. Form.:
C18H14BrNOS
Mol. Mass.:
372.279
SMILES:
CC(=O)C=C1SC=C(N1c1ccccc1)c1ccc(Br)cc1
: