Target
Group 3 secretory phospholipase A2
Ligand
BDBM53801
Substrate
Meas. Tech.
QFRET-based biochemical high throughput dose response assay to identify inhibitors of human group III secreted phospholipase A2 enzyme (HGIII-sPLA2)
IC50
48016±n/a nM
Citation
 PubChem, PC QFRET-based biochemical high throughput dose response assay to identify inhibitors of human group III secreted phospholipase A2 enzyme (HGIII-sPLA2) PubChem Bioassay (2014)[AID] 
Target
Name:
Group 3 secretory phospholipase A2
Synonyms:
3.1.1.4 Group III secretory phopholipase A2 PA2G3_HUMAN Phosphatidylcholine 2-acylhydrolase 3 sPLA2-III
Type:
PROTEIN
Mol. Mass.:
57196.58
Organism:
Homo sapiens
Description:
ChEMBL_119722
Residue:
509
  
Inhibitor
Name:
BDBM53801
Synonyms:
2-[(3,5-diketo-2H-1,2,4-triazin-6-yl)thio]-N-(p-anisylideneamino)acetamide 2-[(3,5-dioxo-2H-1,2,4-triazin-6-yl)sulfanyl]-N-[(4-methoxyphenyl)methylideneamino]acetamide 2-[[3,5-bis(oxidanylidene)-2H-1,2,4-triazin-6-yl]sulfanyl]-N-[(4-methoxyphenyl)methylideneamino]ethanamide SMR000193980 | cid_1576716
Type:
Small organic molecule
Emp. Form.:
C13H13N5O4S
Mol. Mass.:
335.338
SMILES:
COc1ccc(C=NNC(=O)CSc2n[nH]c(=O)[nH]c2=O)cc1
: