Target
Group 3 secretory phospholipase A2
Ligand
BDBM114587
Substrate
Meas. Tech.
QFRET-based biochemical high throughput dose response assay to identify inhibitors of human group III secreted phospholipase A2 enzyme (HGIII-sPLA2)
IC50
6133±n/a nM
Citation
 PubChem, PC QFRET-based biochemical high throughput dose response assay to identify inhibitors of human group III secreted phospholipase A2 enzyme (HGIII-sPLA2) PubChem Bioassay (2014)[AID] 
Target
Name:
Group 3 secretory phospholipase A2
Synonyms:
3.1.1.4 Group III secretory phopholipase A2 PA2G3_HUMAN Phosphatidylcholine 2-acylhydrolase 3 sPLA2-III
Type:
PROTEIN
Mol. Mass.:
57196.58
Organism:
Homo sapiens
Description:
ChEMBL_119722
Residue:
509
  
Inhibitor
Name:
BDBM114587
Synonyms:
MLS002702490 N,N-dimethyl-4-[(1-methyl-6-nitro-2-phenyl-pyrazolo[1,5-a]indol-1-ium-4-ylidene)methyl]aniline;tris(fluoranyl)methanesulfonate SMR001566051 dimethyl-[4-[(1-methyl-6-nitro-2-phenyl-pyrazol[1,5-a]indol-1-ium-4-ylidene)methyl]phenyl]amine;triflate
Type:
Small organic molecule
Emp. Form.:
C26H23N4O2
Mol. Mass.:
423.4859
SMILES:
CN(C)c1ccc(C=c2c3cc(ccc3n3[n+](C)c(cc23)-c2ccccc2)[N+]([O-])=O)cc1
: