Target
Mu-type opioid receptor
Ligand
BDBM38788
Substrate
Meas. Tech.
Late stage Counterscreen for the probe development effort to identify agonists of the mouse 5-hydroxytryptamine (serotonin) receptor 2A (HTR2A)
EC50
92470±n/a nM
Citation
 PubChem, PC Late stage Counterscreen for the probe development effort to identify agonists of the mouse 5-hydroxytryptamine (serotonin) receptor 2A (HTR2A): Luminescence-based cell-based high throughput dose response assay to identify agonists of the mu 1 opioid receptor (OPRM1) PubChem Bioassay (2013)[AID] 
Target
Name:
Mu-type opioid receptor
Synonyms:
M-OR-1 MOR-1 MUOR1 Mu opiate receptor OPRM1 hMOP | mu-type opioid receptor isoform MOR-1
Type:
G Protein-Coupled Receptor (GPCR)
Mol. Mass.:
44789.51
Organism:
Homo sapiens (Human)
Description:
P35372
Residue:
400
  
Inhibitor
Name:
BDBM38788
Synonyms:
MLS000108391 [4-(3-ethoxy-4-methoxy-benzyl)piperazino]-(2-furyl)methanone [4-[(3-ethoxy-4-methoxyphenyl)methyl]-1-piperazinyl]-(2-furanyl)methanone cid_787169
Type:
Small organic molecule
Emp. Form.:
C19H24N2O4
Mol. Mass.:
344.4049
SMILES:
CCOc1cc(CN2CCN(CC2)C(=O)c2ccco2)ccc1OC
: