Target
5-hydroxytryptamine receptor 2A
Ligand
BDBM114599
Substrate
Meas. Tech.
Late stage for the probe development effort to identify agonists of the mouse 5-hydroxytryptamine (serotonin) receptor 2A (HTR2A)
EC50
76083±n/a nM
Citation
 PubChem, PC Late stage for the probe development effort to identify agonists of the mouse 5-hydroxytryptamine (serotonin) receptor 2A (HTR2A): Luminescence-based cell-based high throughput dose response assay for agonists of the mouse 5-hydroxytryptamine (serotonin) receptor 2A (HTR2A) PubChem Bioassay (2013)[AID] 
Target
Name:
5-hydroxytryptamine receptor 2A
Synonyms:
5-HT-2 5-hydroxytryptamine receptor 2A 5HT2A_MOUSE Htr2 Serotonin 2a (5-HT2a) receptor
Type:
Enzyme
Mol. Mass.:
52843.00
Organism:
Mus musculus (Mouse)
Description:
P35363
Residue:
471
  
Inhibitor
Name:
BDBM114599
Synonyms:
1-(3-methoxyphenoxy)-3-(4-pyridin-2-ylpiperazin-1-yl)propan-2-ol 1-(3-methoxyphenoxy)-3-[4-(2-pyridyl)piperazino]propan-2-ol SR-01000446204-3 | cid_2770277
Type:
Small organic molecule
Emp. Form.:
C19H25N3O3
Mol. Mass.:
343.4201
SMILES:
COc1cccc(OCC(O)CN2CCN(CC2)c2ccccn2)c1
: