Target
5-hydroxytryptamine receptor 2A
Ligand
BDBM114625
Substrate
Meas. Tech.
Late stage for the probe development effort to identify agonists of the mouse 5-hydroxytryptamine (serotonin) receptor 2A (HTR2A)
EC50
76083±n/a nM
Citation
 PubChem, PC Late stage for the probe development effort to identify agonists of the mouse 5-hydroxytryptamine (serotonin) receptor 2A (HTR2A): Luminescence-based cell-based high throughput dose response assay for agonists of the mouse 5-hydroxytryptamine (serotonin) receptor 2A (HTR2A) PubChem Bioassay (2013)[AID] 
Target
Name:
5-hydroxytryptamine receptor 2A
Synonyms:
5-HT-2 5-hydroxytryptamine receptor 2A 5HT2A_MOUSE Htr2 Serotonin 2a (5-HT2a) receptor
Type:
Enzyme
Mol. Mass.:
52843.00
Organism:
Mus musculus (Mouse)
Description:
P35363
Residue:
471
  
Inhibitor
Name:
BDBM114625
Synonyms:
2-[4-(4-methoxy-2,3-dimethyl-benzyl)piperazino]pyrimidine 2-[4-[(4-methoxy-2,3-dimethylphenyl)methyl]-1-piperazinyl]pyrimidine SR-01000201524 cid_791369
Type:
Small organic molecule
Emp. Form.:
C18H24N4O
Mol. Mass.:
312.4094
SMILES:
COc1ccc(CN2CCN(CC2)c2ncccn2)c(C)c1C
: