Target
Methyl-CpG-binding domain protein 2
Ligand
BDBM114644
Substrate
Meas. Tech.
TRFRET-based biochemical high throughput dose response assay to identify inhibitors of 5-meCpG-binding domain protein 2 (MBD2)-DBD binding to methylated oligonucleotide
IC50
17428±n/a nM
Citation
 PubChem, PC TRFRET-based biochemical high throughput dose response assay to identify inhibitors of 5-meCpG-binding domain protein 2 (MBD2)-DBD binding to methylated oligonucleotide PubChem Bioassay (2013)[AID] 
Target
Name:
Methyl-CpG-binding domain protein 2
Synonyms:
MBD2 Methyl-CpG binding domain protein 2 | Methyl-CpG-binding domain protein 2 (MBD2)
Type:
Enzyme Catalytic Domain
Mol. Mass.:
43278.74
Organism:
Homo sapiens (Human)
Description:
gi_21595776
Residue:
411
  
Inhibitor
Name:
BDBM114644
Synonyms:
1-hydroxy-10,12-dimethoxy-8-methyl-4-(3,4,5-trihydroxy-4,6-dimethyl-2-oxanyl)-6-naphtho[1,2-c][2]benzopyranone 1-hydroxy-10,12-dimethoxy-8-methyl-4-(3,4,5-trihydroxy-4,6-dimethyloxan-2-yl)naphtho[1,2-c]isochromen-6-one ALBACARCIN M SMR001566705 | cid_174343
Type:
Small organic molecule
Emp. Form.:
C27H28O9
Mol. Mass.:
496.5058
SMILES:
COc1cc(C)cc2c1c1cc(OC)c3c(O)ccc(C4OC(C)C(O)C(C)(O)C4O)c3c1oc2=O
: