Target
Fibrinogen beta chain [164-491]
Ligand
BDBM53152
Substrate
Meas. Tech.
Fluorescence polarization-based biochemical high throughput dose response assay to identify inhibitors that disrupt the binding of a cyclic peptide (Tn6) to the fibrin proteolytic product D-Dimer
IC50
11320±n/a nM
Citation
 PubChem, PC Fluorescence polarization-based biochemical high throughput dose response assay to identify inhibitors that disrupt the binding of a cyclic peptide (Tn6) to the fibrin proteolytic product D-Dimer and fragment E complex [DD(E )] PubChem Bioassay (2013)[AID] 
Target
Name:
Fibrinogen beta chain [164-491]
Synonyms:
Chain E, Fragment Double-D From Human Fibrin FIBB_HUMAN
Type:
Enzyme Catalytic Domain
Mol. Mass.:
37647.12
Organism:
Homo sapiens (Human)
Description:
gi_28373962
Residue:
328
  
Inhibitor
Name:
BDBM53152
Synonyms:
1-methyl-4-(2-nitrophenyl)-4,6,7,8-tetrahydro-3H-quinazoline-2,5-dione 1-methyl-4-(2-nitrophenyl)-4,6,7,8-tetrahydroquinazoline-2,5(1H,3H)-dione SMR000556157 | cid_2917512
Type:
Small organic molecule
Emp. Form.:
C15H15N3O4
Mol. Mass.:
301.2973
SMILES:
CN1C(=O)NC(C2=C1CCCC2=O)c1ccccc1[N+]([O-])=O
: