Target
Fibrinogen beta chain [164-491]
Ligand
BDBM67841
Substrate
Meas. Tech.
Fluorescence polarization-based biochemical high throughput dose response assay to identify inhibitors that disrupt the binding of a cyclic peptide (Tn7) to the fibrin proteolytic product D-Dimer
IC50
83284±n/a nM
Citation
 PubChem, PC Fluorescence polarization-based biochemical high throughput dose response assay to identify inhibitors that disrupt the binding of a cyclic peptide (Tn7) to the fibrin proteolytic product D-Dimer and fragment E complex [DD(E )] PubChem Bioassay (2013)[AID] 
Target
Name:
Fibrinogen beta chain [164-491]
Synonyms:
Chain E, Fragment Double-D From Human Fibrin FIBB_HUMAN
Type:
Enzyme Catalytic Domain
Mol. Mass.:
37647.12
Organism:
Homo sapiens (Human)
Description:
gi_28373962
Residue:
328
  
Inhibitor
Name:
BDBM67841
Synonyms:
2,4,6-trimethyl-N-[2-(2-methyl-1-indolyl)ethyl]benzenesulfonamide MLS000529641 cid_3656108
Type:
Small organic molecule
Emp. Form.:
C20H24N2O2S
Mol. Mass.:
356.482
SMILES:
Cc1cc2ccccc2n1CCNS(=O)(=O)c1c(C)cc(C)cc1C
: