Target
Protein artemis
Ligand
BDBM114672
Substrate
Meas. Tech.
Dose Response confirmation of small molecule inhibitors originally identified via uHTS of Artemis endonuclease activity via a fluorescence intensity assay
IC50
3620±n/a nM
Citation
 PubChem, PC Dose Response confirmation of small molecule inhibitors originally identified via uHTS of Artemis endonuclease activity via a fluorescence intensity assay PubChem Bioassay (2013)[AID] 
Target
Name:
Protein artemis
Synonyms:
ARTEMIS DCLRE1C SCIDA protein artemis isoform a
Type:
Enzyme Catalytic Domain
Mol. Mass.:
78427.91
Organism:
Homo sapiens (Human)
Description:
gi_76496497
Residue:
692
  
Inhibitor
Name:
BDBM114672
Synonyms:
2-[(1E)-1-hydroxyiminoethyl]benzoic acid 2-[(E)-N-hydroxy-C-methylcarbonimidoyl]benzoic acid MLS000080795 cid_9557441
Type:
Small organic molecule
Emp. Form.:
C9H9NO3
Mol. Mass.:
179.1727
SMILES:
CC(N=O)c1ccccc1C(O)=O
: