Target
Protein artemis
Ligand
BDBM32264
Substrate
Meas. Tech.
Dose Response confirmation of small molecule inhibitors originally identified via uHTS of Artemis endonuclease activity via a fluorescence intensity assay
IC50
4710±n/a nM
Citation
 PubChem, PC Dose Response confirmation of small molecule inhibitors originally identified via uHTS of Artemis endonuclease activity via a fluorescence intensity assay PubChem Bioassay (2013)[AID] 
Target
Name:
Protein artemis
Synonyms:
ARTEMIS DCLRE1C SCIDA protein artemis isoform a
Type:
Enzyme Catalytic Domain
Mol. Mass.:
78427.91
Organism:
Homo sapiens (Human)
Description:
gi_76496497
Residue:
692
  
Inhibitor
Name:
BDBM32264
Synonyms:
4-(1-azepanyl)-2-(2-pyridinyl)quinazoline 4-(azepan-1-yl)-2-pyridin-2-yl-quinazoline MLS000042263 cid_665597
Type:
Small organic molecule
Emp. Form.:
C19H20N4
Mol. Mass.:
304.3889
SMILES:
C1CCCN(CC1)c1nc(nc2ccccc12)-c1ccccn1
: