Target
Protein artemis
Ligand
BDBM84434
Substrate
Meas. Tech.
Dose Response confirmation of small molecule inhibitors originally identified via uHTS of Artemis endonuclease activity via a fluorescence intensity assay
IC50
20000±n/a nM
Citation
 PubChem, PC Dose Response confirmation of small molecule inhibitors originally identified via uHTS of Artemis endonuclease activity via a fluorescence intensity assay PubChem Bioassay (2013)[AID] 
Target
Name:
Protein artemis
Synonyms:
ARTEMIS DCLRE1C SCIDA protein artemis isoform a
Type:
Enzyme Catalytic Domain
Mol. Mass.:
78427.91
Organism:
Homo sapiens (Human)
Description:
gi_76496497
Residue:
692
  
Inhibitor
Name:
BDBM84434
Synonyms:
5-(3-chlorophenyl)-N-piazthiol-4-yl-2-furamide | cid_2273874
Type:
Small organic molecule
Emp. Form.:
C17H10ClN3O2S
Mol. Mass.:
355.798
SMILES:
Clc1cccc(c1)-c1ccc(o1)C(=O)Nc1cccc2nsnc12
: