Target
Protein artemis
Ligand
BDBM49124
Substrate
Meas. Tech.
Dose Response confirmation of small molecule inhibitors originally identified via uHTS of Artemis endonuclease activity via a fluorescence intensity assay
IC50
20000±n/a nM
Citation
 PubChem, PC Dose Response confirmation of small molecule inhibitors originally identified via uHTS of Artemis endonuclease activity via a fluorescence intensity assay PubChem Bioassay (2013)[AID] 
Target
Name:
Protein artemis
Synonyms:
ARTEMIS DCLRE1C SCIDA protein artemis isoform a
Type:
Enzyme Catalytic Domain
Mol. Mass.:
78427.91
Organism:
Homo sapiens (Human)
Description:
gi_76496497
Residue:
692
  
Inhibitor
Name:
BDBM49124
Synonyms:
MLS000082574 cid_665142
Type:
Small organic molecule
Emp. Form.:
C21H22N4O3S2
Mol. Mass.:
442.554
SMILES:
CSc1nc(N(CCO)CCO)c2sc3nc(-c4ccco4)c4CCCc4c3c2n1
: