Target
Tegument protein VP16
Ligand
BDBM63757
Substrate
Meas. Tech.
Counterscreen for inhibitors of COUP-TFII (NR2F2): Luminescence-based cell-based high throughput dose response assay to identify inhibitors of the Herpes Virus Virion Protein 16 (VP16)
IC50
40380±n/a nM
Citation
 PubChem, PC Counterscreen for inhibitors of COUP-TFII (NR2F2): Luminescence-based cell-based high throughput dose response assay to identify inhibitors of the Herpes Virus Virion Protein 16 (VP16) PubChem Bioassay (2013)[AID] 
Target
Name:
Tegument protein VP16
Synonyms:
Alpha trans-inducing protein (VP16) transactivating tegument protein VP16
Type:
PROTEIN
Mol. Mass.:
54325.13
Organism:
Human herpesvirus 1 (strain 17) (HHV-1) (Human herpes simplex virus1)
Description:
EBI_100271
Residue:
490
  
Inhibitor
Name:
BDBM63757
Synonyms:
5-(2,3-dihydro-1,4-benzodioxin-6-ylhydrazinylidene)-1,3-diazinane-2,4,6-trione MLS001018136 cid_5807017
Type:
Small organic molecule
Emp. Form.:
C12H10N4O5
Mol. Mass.:
290.2316
SMILES:
O=[#6]-1-[#7]-[#6](=O)\[#6](=[#7]\[#7]-c2ccc3-[#8]-[#6]-[#6]-[#8]-c3c2)-[#6](=O)-[#7]-1
: