Target
Tegument protein VP16
Ligand
BDBM79592
Substrate
Meas. Tech.
Counterscreen for inhibitors of COUP-TFII (NR2F2): Luminescence-based cell-based high throughput dose response assay to identify inhibitors of the Herpes Virus Virion Protein 16 (VP16)
IC50
12618±n/a nM
Citation
 PubChem, PC Counterscreen for inhibitors of COUP-TFII (NR2F2): Luminescence-based cell-based high throughput dose response assay to identify inhibitors of the Herpes Virus Virion Protein 16 (VP16) PubChem Bioassay (2013)[AID] 
Target
Name:
Tegument protein VP16
Synonyms:
Alpha trans-inducing protein (VP16) transactivating tegument protein VP16
Type:
PROTEIN
Mol. Mass.:
54325.13
Organism:
Human herpesvirus 1 (strain 17) (HHV-1) (Human herpes simplex virus1)
Description:
EBI_100271
Residue:
490
  
Inhibitor
Name:
BDBM79592
Synonyms:
4-(2,4,6-triphenyl-1-pyridin-1-iumyl)phenol;perchlorate MLS001240923 cid_12627145
Type:
Small organic molecule
Emp. Form.:
C29H22NO
Mol. Mass.:
400.4905
SMILES:
Oc1ccc(cc1)-[n+]1c(cc(cc1-c1ccccc1)-c1ccccc1)-c1ccccc1
: