Target
Potassium channel subfamily K member 3
Ligand
BDBM218280
Substrate
Meas. Tech.
Activity Assay
Temperature
298.15±n/a K
IC50
49±n/a nM
Comments
extracted
Citation
 Bialy, LLorenz, KWirth, KSteinmeyer, KHessler, G Fused pyrroledicarboxamides and their use as pharmaceuticals US Patent  US9884860 Publication Date 2/6/2018 
Target
Name:
Potassium channel subfamily K member 3
Synonyms:
Acid-sensitive potassium channel TASK-1 KCNK3 Potassium channel protein TASK-1 Potassium channel subfamily K member 3 (TASK-1) TASK1 Two pore K(+) channel KT3.1 | Two pore potassium channel KT3.1
Type:
Protein
Mol. Mass.:
43534.71
Organism:
Homo sapiens (Human)
Description:
O14649
Residue:
394
  
Inhibitor
Name:
BDBM218280
Synonyms:
US9284333, 16u | US9884860, Example 16u
Type:
Small organic molecule
Emp. Form.:
C23H27ClFN3O3
Mol. Mass.:
447.93
SMILES:
CC[C@@H](NC(=O)c1cc(C(=O)N2CCC[C@@H]2C)n2CCOCc12)c1ccc(F)cc1Cl
: