Target
Nuclear hormone receptor family member daf-12
Ligand
BDBM49298
Substrate
Meas. Tech.
Luminescence-based cell-based high throughput dose response assay to identify agonists of the DAF-12 from the parasite H. contortus (hcDAF-12)
EC50
67529±n/a nM
Citation
 PubChem, PC Luminescence-based cell-based high throughput dose response assay to identify agonists of the DAF-12 from the parasite H. contortus (hcDAF-12) PubChem Bioassay (2013)[AID] 
Target
Name:
Nuclear hormone receptor family member daf-12
Synonyms:
DAF12_CAEEL XL285 daf-20 | mig-7
Type:
Enzyme Catalytic Domain
Mol. Mass.:
84211.49
Organism:
Caenorhabditis elegans
Description:
gi_71987181
Residue:
753
  
Inhibitor
Name:
BDBM49298
Synonyms:
5-(2-fluorophenyl)-3-phenyl-1,2,4-oxadiazole SMR000070388 | cid_2876651
Type:
Small organic molecule
Emp. Form.:
C14H9FN2O
Mol. Mass.:
240.2325
SMILES:
Fc1ccccc1-c1nc(no1)-c1ccccc1
: