Target
Nuclear hormone receptor family member daf-12
Ligand
BDBM114819
Substrate
Meas. Tech.
Luminescence-based cell-based high throughput dose response assay to identify agonists of the DAF-12 from the parasite H. contortus (hcDAF-12)
EC50
67439±n/a nM
Citation
 PubChem, PC Luminescence-based cell-based high throughput dose response assay to identify agonists of the DAF-12 from the parasite H. contortus (hcDAF-12) PubChem Bioassay (2013)[AID] 
Target
Name:
Nuclear hormone receptor family member daf-12
Synonyms:
DAF12_CAEEL XL285 daf-20 | mig-7
Type:
Enzyme Catalytic Domain
Mol. Mass.:
84211.49
Organism:
Caenorhabditis elegans
Description:
gi_71987181
Residue:
753
  
Inhibitor
Name:
BDBM114819
Synonyms:
2-(1-Indanylidene)-1-indanone 2-indan-1-ylideneindan-1-one SMR001548030 | cid_226774
Type:
Small organic molecule
Emp. Form.:
C18H14O
Mol. Mass.:
246.3032
SMILES:
O=C1C(Cc2ccccc12)=C1CCc2ccccc12
: