Target
Nuclear hormone receptor family member daf-12
Ligand
BDBM34853
Substrate
Meas. Tech.
Luminescence-based cell-based high throughput dose response assay to identify activators of the DAF-12 from the parasite S. stercoralis (ssDAF-12)
IC50
67537±n/a nM
Citation
 PubChem, PC Luminescence-based cell-based high throughput dose response assay to identify activators of the DAF-12 from the parasite S. stercoralis (ssDAF-12) PubChem Bioassay (2013)[AID] 
Target
Name:
Nuclear hormone receptor family member daf-12
Synonyms:
DAF12_CAEEL XL285 daf-20 | mig-7
Type:
Enzyme Catalytic Domain
Mol. Mass.:
84211.49
Organism:
Caenorhabditis elegans
Description:
gi_71987181
Residue:
753
  
Inhibitor
Name:
BDBM34853
Synonyms:
(6-chloro-2-phenyl-benzotriazol-5-yl)amine 6-chloro-2-phenyl-5-benzotriazolamine MLS000706165 cid_736374
Type:
Small organic molecule
Emp. Form.:
C12H9ClN4
Mol. Mass.:
244.68
SMILES:
Nc1cc2nn(nc2cc1Cl)-c1ccccc1
: