Target
Nuclear hormone receptor family member daf-12
Ligand
BDBM114935
Substrate
Meas. Tech.
Luminescence-based cell-based high throughput dose response assay to identify activators of the DAF-12 from the parasite S. stercoralis (ssDAF-12)
IC50
67491±n/a nM
Citation
 PubChem, PC Luminescence-based cell-based high throughput dose response assay to identify activators of the DAF-12 from the parasite S. stercoralis (ssDAF-12) PubChem Bioassay (2013)[AID] 
Target
Name:
Nuclear hormone receptor family member daf-12
Synonyms:
DAF12_CAEEL XL285 daf-20 | mig-7
Type:
Enzyme Catalytic Domain
Mol. Mass.:
84211.49
Organism:
Caenorhabditis elegans
Description:
gi_71987181
Residue:
753
  
Inhibitor
Name:
BDBM114935
Synonyms:
MLS001174493 N-(2,3-dihydro-1H-inden-5-yl)-2-methoxy-4-methylsulfanyl-benzamide N-indan-5-yl-2-methoxy-4-(methylthio)benzamide cid_2124983
Type:
Small organic molecule
Emp. Form.:
C18H19NO2S
Mol. Mass.:
313.414
SMILES:
COc1cc(SC)ccc1C(=O)Nc1ccc2CCCc2c1
: