Target
Nuclear hormone receptor family member daf-12
Ligand
BDBM96305
Substrate
Meas. Tech.
Luminescence-based cell-based high throughput dose response assay to identify activators of the DAF-12 from the parasite S. stercoralis (ssDAF-12)
IC50
67642±n/a nM
Citation
 PubChem, PC Luminescence-based cell-based high throughput dose response assay to identify activators of the DAF-12 from the parasite S. stercoralis (ssDAF-12) PubChem Bioassay (2013)[AID] 
Target
Name:
Nuclear hormone receptor family member daf-12
Synonyms:
DAF12_CAEEL XL285 daf-20 | mig-7
Type:
Enzyme Catalytic Domain
Mol. Mass.:
84211.49
Organism:
Caenorhabditis elegans
Description:
gi_71987181
Residue:
753
  
Inhibitor
Name:
BDBM96305
Synonyms:
4-amino-5-chloro-1-(4-hydroxy-5-methylol-tetrahydrofuran-2-yl)pyrimidin-2-one 4-amino-5-chloro-1-[4-hydroxy-5-(hydroxymethyl)oxolan-2-yl]pyrimidin-2-one CYTOCHLOR SMR002049134 | cid_340558
Type:
Small organic molecule
Emp. Form.:
C9H12ClN3O4
Mol. Mass.:
261.662
SMILES:
Nc1nc(=O)n(cc1Cl)C1CC(O)C(CO)O1
: