Target
Oxysterols receptor LXR-beta
Ligand
BDBM114717
Substrate
Meas. Tech.
Counterscreen for agonists of the daf-12 abnormal Dauer Formation: Luminescence-based cell-based dose response assay to identify agonists of the Liver-X-Receptor (LXR).
EC50
67536±n/a nM
Citation
 PubChem, PC Counterscreen for agonists of the daf-12 abnormal Dauer Formation: Luminescence-based cell-based dose response assay to identify agonists of the Liver-X-Receptor (LXR). PubChem Bioassay (2013)[AID] 
Target
Name:
Oxysterols receptor LXR-beta
Synonyms:
LXRB Liver X, LXR beta NR1H2 Nuclear receptor NER Ubiquitously-expressed nuclear receptor
Type:
Enzyme Catalytic Domain
Mol. Mass.:
50978.79
Organism:
Homo sapiens (Human)
Description:
P55055
Residue:
460
  
Inhibitor
Name:
BDBM114717
Synonyms:
4-hydroxy-2,6-diphenyl-1,4-oxaphosphinine 4-oxide 4-oxidanyl-2,6-diphenyl-1,4-oxaphosphinine 4-oxide SMR000059942 | cid_2322533
Type:
Small organic molecule
Emp. Form.:
C16H13O3P
Mol. Mass.:
284.2464
SMILES:
OP1(=O)C=C(OC(=C1)c1ccccc1)c1ccccc1
: