Target
Oxysterols receptor LXR-beta
Ligand
BDBM114783
Substrate
Meas. Tech.
Counterscreen for agonists of the daf-12 abnormal Dauer Formation: Luminescence-based cell-based dose response assay to identify agonists of the Liver-X-Receptor (LXR).
EC50
67581±n/a nM
Citation
 PubChem, PC Counterscreen for agonists of the daf-12 abnormal Dauer Formation: Luminescence-based cell-based dose response assay to identify agonists of the Liver-X-Receptor (LXR). PubChem Bioassay (2013)[AID] 
Target
Name:
Oxysterols receptor LXR-beta
Synonyms:
LXRB Liver X, LXR beta NR1H2 Nuclear receptor NER Ubiquitously-expressed nuclear receptor
Type:
Enzyme Catalytic Domain
Mol. Mass.:
50978.79
Organism:
Homo sapiens (Human)
Description:
P55055
Residue:
460
  
Inhibitor
Name:
BDBM114783
Synonyms:
2-(4-methylsulfanylphenyl)-5-phenyl-2,3-dihydro-1,3,4-thiadiazole MLS001179601 cid_4570467 | methyl4-(5-phenyl-2,3-dihydro-1,3,4-thiadiazol-2-yl)phenylsulfide
Type:
Small organic molecule
Emp. Form.:
C15H14N2S2
Mol. Mass.:
286.415
SMILES:
CSc1ccc(cc1)C1=NNC(S1)c1ccccc1
: