Target
Oxysterols receptor LXR-beta
Ligand
BDBM76704
Substrate
Meas. Tech.
Counterscreen for agonists of the daf-12 abnormal Dauer Formation: Luminescence-based cell-based dose response assay to identify agonists of the Liver-X-Receptor (LXR).
EC50
67595±n/a nM
Citation
 PubChem, PC Counterscreen for agonists of the daf-12 abnormal Dauer Formation: Luminescence-based cell-based dose response assay to identify agonists of the Liver-X-Receptor (LXR). PubChem Bioassay (2013)[AID] 
Target
Name:
Oxysterols receptor LXR-beta
Synonyms:
LXRB Liver X, LXR beta NR1H2 Nuclear receptor NER Ubiquitously-expressed nuclear receptor
Type:
Enzyme Catalytic Domain
Mol. Mass.:
50978.79
Organism:
Homo sapiens (Human)
Description:
P55055
Residue:
460
  
Inhibitor
Name:
BDBM76704
Synonyms:
(2Z)-2-(p-tolyl)-2-(quinazolin-4-ylhydrazono)acetic acid ethyl ester 2-(p-tolyl)-2-(quinazolin-4-ylhydrazono)acetic acid ethyl ester SMR000595544 ethyl 2-(4-methylphenyl)-2-(quinazolin-4-ylhydrazinylidene)acetate | ethyl 2-(4-methylphenyl)-2-(quinazolin-4-ylhydrazinylidene)ethanoate
Type:
Small organic molecule
Emp. Form.:
C19H18N4O2
Mol. Mass.:
334.3718
SMILES:
CCOC(=O)C(=NNc1ncnc2ccccc12)c1ccc(C)cc1
: