Target
Oxysterols receptor LXR-beta
Ligand
BDBM115013
Substrate
Meas. Tech.
Counterscreen for agonists of the daf-12 abnormal Dauer Formation: Luminescence-based cell-based dose response screening assay to identify agonists of the Liver-X-Receptor (LXR)
EC50
67608±n/a nM
Citation
 PubChem, PC Counterscreen for agonists of the daf-12 abnormal Dauer Formation: Luminescence-based cell-based dose response screening assay to identify agonists of the Liver-X-Receptor (LXR) PubChem Bioassay (2013)[AID] 
Target
Name:
Oxysterols receptor LXR-beta
Synonyms:
LXRB Liver X, LXR beta NR1H2 Nuclear receptor NER Ubiquitously-expressed nuclear receptor
Type:
Enzyme Catalytic Domain
Mol. Mass.:
50978.79
Organism:
Homo sapiens (Human)
Description:
P55055
Residue:
460
  
Inhibitor
Name:
BDBM115013
Synonyms:
3-(5-bromanylfuran-2-yl)-5-phenyl-1,2,4-oxadiazole 3-(5-bromo-2-furyl)-5-phenyl-1,2,4-oxadiazole MLS000674457 cid_5150753
Type:
Small organic molecule
Emp. Form.:
C12H7BrN2O2
Mol. Mass.:
291.1
SMILES:
Brc1ccc(o1)-c1noc(n1)-c1ccccc1
: