Target
Oxysterols receptor LXR-beta
Ligand
BDBM115033
Substrate
Meas. Tech.
Counterscreen for agonists of the daf-12 abnormal Dauer Formation: Luminescence-based cell-based dose response screening assay to identify agonists of the Liver-X-Receptor (LXR)
EC50
67541±n/a nM
Citation
 PubChem, PC Counterscreen for agonists of the daf-12 abnormal Dauer Formation: Luminescence-based cell-based dose response screening assay to identify agonists of the Liver-X-Receptor (LXR) PubChem Bioassay (2013)[AID] 
Target
Name:
Oxysterols receptor LXR-beta
Synonyms:
LXRB Liver X, LXR beta NR1H2 Nuclear receptor NER Ubiquitously-expressed nuclear receptor
Type:
Enzyme Catalytic Domain
Mol. Mass.:
50978.79
Organism:
Homo sapiens (Human)
Description:
P55055
Residue:
460
  
Inhibitor
Name:
BDBM115033
Synonyms:
(E)-1-(2-furyl)ethylidene-[2-methylimino-4-(2-thienyl)-4-thiazolin-3-yl]amine (E)-3-[(E)-1-(furan-2-yl)ethylideneamino]-N-methyl-4-thiophen-2-yl-1,3-thiazol-2-imine SMR000385489 | cid_9630484
Type:
Small organic molecule
Emp. Form.:
C14H13N3OS2
Mol. Mass.:
303.403
SMILES:
CN=c1scc(-c2cccs2)n1N=C(C)c1ccco1
: