Target
Oxysterols receptor LXR-beta
Ligand
BDBM115040
Substrate
Meas. Tech.
Counterscreen for agonists of the daf-12 abnormal Dauer Formation: Luminescence-based cell-based dose response screening assay to identify agonists of the Liver-X-Receptor (LXR)
EC50
67526±n/a nM
Citation
 PubChem, PC Counterscreen for agonists of the daf-12 abnormal Dauer Formation: Luminescence-based cell-based dose response screening assay to identify agonists of the Liver-X-Receptor (LXR) PubChem Bioassay (2013)[AID] 
Target
Name:
Oxysterols receptor LXR-beta
Synonyms:
LXRB Liver X, LXR beta NR1H2 Nuclear receptor NER Ubiquitously-expressed nuclear receptor
Type:
Enzyme Catalytic Domain
Mol. Mass.:
50978.79
Organism:
Homo sapiens (Human)
Description:
P55055
Residue:
460
  
Inhibitor
Name:
BDBM115040
Synonyms:
(3E)-2-keto-3-vanillylidene-indolizine-1-carbonitrile (3E)-3-[(4-hydroxy-3-methoxyphenyl)methylidene]-2-oxo-1-indolizinecarbonitrile MLS000776195 cid_6901173
Type:
Small organic molecule
Emp. Form.:
C17H12N2O3
Mol. Mass.:
292.2888
SMILES:
COc1cc(\C=C2\N3C=CC=CC3=C(C#N)C2=O)ccc1O
: