Target
PC4 and SFRS1-interacting protein
Ligand
BDBM39953
Substrate
Meas. Tech.
Counterscreen for inhibitors of LEDGF/p75-dependent integration: TR-FRET-based biochemical high throughput dose response counterscreen assay to identify activators of HIV-1 Integrase multimerization
IC50
53703±n/a nM
Citation
 PubChem, PC Counterscreen for inhibitors of LEDGF/p75-dependent integration: TR-FRET-based biochemical high throughput dose response counterscreen assay to identify activators of HIV-1 Integrase multimerization PubChem Bioassay (2014)[AID] 
Target
Name:
PC4 and SFRS1-interacting protein
Synonyms:
DFS70 LEDGF/p75 PSIP1_HUMAN lens epithelium-derived growth factor p75
Type:
Enzyme Catalytic Domain
Mol. Mass.:
60120.68
Organism:
Homo sapiens (Human)
Description:
gi_6708281
Residue:
530
  
Inhibitor
Name:
BDBM39953
Synonyms:
4-keto-4-(2-thienyl)butyric acid [2-(2-furfurylamino)-2-keto-ethyl] ester MLS000054585 [2-(furan-2-ylmethylamino)-2-oxidanylidene-ethyl] 4-oxidanylidene-4-thiophen-2-yl-butanoate cid_2355490
Type:
Small organic molecule
Emp. Form.:
C15H15NO5S
Mol. Mass.:
321.348
SMILES:
O=C(COC(=O)CCC(=O)c1cccs1)NCc1ccco1
: