Target
PC4 and SFRS1-interacting protein
Ligand
BDBM64786
Substrate
Meas. Tech.
Counterscreen for inhibitors of LEDGF/p75-dependent integration: TR-FRET-based biochemical high throughput dose response counterscreen assay to identify activators of HIV-1 Integrase multimerization
IC50
16469±n/a nM
Citation
 PubChem, PC Counterscreen for inhibitors of LEDGF/p75-dependent integration: TR-FRET-based biochemical high throughput dose response counterscreen assay to identify activators of HIV-1 Integrase multimerization PubChem Bioassay (2014)[AID] 
Target
Name:
PC4 and SFRS1-interacting protein
Synonyms:
DFS70 LEDGF/p75 PSIP1_HUMAN lens epithelium-derived growth factor p75
Type:
Enzyme Catalytic Domain
Mol. Mass.:
60120.68
Organism:
Homo sapiens (Human)
Description:
gi_6708281
Residue:
530
  
Inhibitor
Name:
BDBM64786
Synonyms:
1-(2,1,3-benzothiadiazol-5-yl)-3-(4-methoxyphenyl)thiourea MLS000585342 SMR000204105 | cid_753169
Type:
Small organic molecule
Emp. Form.:
C14H12N4OS2
Mol. Mass.:
316.401
SMILES:
COc1ccc(NC(=S)Nc2ccc3nsnc3c2)cc1
: