Target
PC4 and SFRS1-interacting protein
Ligand
BDBM50533
Substrate
Meas. Tech.
Counterscreen for inhibitors of LEDGF/p75-dependent integration: TR-FRET-based biochemical high throughput dose response counterscreen assay to identify activators of HIV-1 Integrase multimerization
IC50
2497±n/a nM
Citation
 PubChem, PC Counterscreen for inhibitors of LEDGF/p75-dependent integration: TR-FRET-based biochemical high throughput dose response counterscreen assay to identify activators of HIV-1 Integrase multimerization PubChem Bioassay (2014)[AID] 
Target
Name:
PC4 and SFRS1-interacting protein
Synonyms:
DFS70 LEDGF/p75 PSIP1_HUMAN lens epithelium-derived growth factor p75
Type:
Enzyme Catalytic Domain
Mol. Mass.:
60120.68
Organism:
Homo sapiens (Human)
Description:
gi_6708281
Residue:
530
  
Inhibitor
Name:
BDBM50533
Synonyms:
3,4,5-trihydroxy-N'-((1E)-{4-methoxy-3-[(4-nitro-1H-pyrazol-1-yl)methyl]phenyl}methylene)benzohydrazide 3,4,5-trihydroxy-N-[[4-methoxy-3-[(4-nitro-1-pyrazolyl)methyl]phenyl]methylideneamino]benzamide 3,4,5-trihydroxy-N-[[4-methoxy-3-[(4-nitropyrazol-1-yl)methyl]phenyl]methylideneamino]benzamide N-[[4-methoxy-3-[(4-nitropyrazol-1-yl)methyl]phenyl]methylideneamino]-3,4,5-tris(oxidanyl)benzamide cid_3618145
Type:
Small organic molecule
Emp. Form.:
C19H17N5O7
Mol. Mass.:
427.3676
SMILES:
COc1ccc([CH+][N-]NC(=O)c2cc(O)c(O)c(O)c2)cc1Cn1cc(cn1)[N+]([O-])=O
: