Target
PC4 and SFRS1-interacting protein
Ligand
BDBM55150
Substrate
Meas. Tech.
Counterscreen for inhibitors of LEDGF/p75-dependent integration: TR-FRET-based biochemical high throughput dose response counterscreen assay to identify activators of HIV-1 Integrase multimerization
IC50
3010±n/a nM
Citation
 PubChem, PC Counterscreen for inhibitors of LEDGF/p75-dependent integration: TR-FRET-based biochemical high throughput dose response counterscreen assay to identify activators of HIV-1 Integrase multimerization PubChem Bioassay (2014)[AID] 
Target
Name:
PC4 and SFRS1-interacting protein
Synonyms:
DFS70 LEDGF/p75 PSIP1_HUMAN lens epithelium-derived growth factor p75
Type:
Enzyme Catalytic Domain
Mol. Mass.:
60120.68
Organism:
Homo sapiens (Human)
Description:
gi_6708281
Residue:
530
  
Inhibitor
Name:
BDBM55150
Synonyms:
(4Z)-2-hydroxy-4-[[2-[(Z)-(3-hydroxy-4-oxocyclohexa-2,5-dien-1-ylidene)methyl]hydrazinyl]methylidene]cyclohexa-2,5-dien-1-one (4Z)-2-hydroxy-4-[[[(Z)-(3-hydroxy-4-oxo-1-cyclohexa-2,5-dienylidene)methyl]hydrazo]methylidene]-1-cyclohexa-2,5-dienone MLS001211916 The compound has not trivial name. | cid_6614358
Type:
Small organic molecule
Emp. Form.:
C14H12N2O4
Mol. Mass.:
272.2561
SMILES:
Oc1ccc(C=NN=Cc2ccc(O)c(O)c2)cc1O
: