Target
PC4 and SFRS1-interacting protein
Ligand
BDBM80760
Substrate
Meas. Tech.
Counterscreen for inhibitors of LEDGF/p75-dependent integration: TR-FRET-based biochemical high throughput dose response counterscreen assay to identify activators of HIV-1 Integrase multimerization
IC50
1563±n/a nM
Citation
 PubChem, PC Counterscreen for inhibitors of LEDGF/p75-dependent integration: TR-FRET-based biochemical high throughput dose response counterscreen assay to identify activators of HIV-1 Integrase multimerization PubChem Bioassay (2014)[AID] 
Target
Name:
PC4 and SFRS1-interacting protein
Synonyms:
DFS70 LEDGF/p75 PSIP1_HUMAN lens epithelium-derived growth factor p75
Type:
Enzyme Catalytic Domain
Mol. Mass.:
60120.68
Organism:
Homo sapiens (Human)
Description:
gi_6708281
Residue:
530
  
Inhibitor
Name:
BDBM80760
Synonyms:
2-[(4-dimethoxyphosphorylanilino)methyl]benzene-1,4-diol 2-[[(4-dimethoxyphosphorylphenyl)amino]methyl]benzene-1,4-diol SMR001565944 | cid_390796
Type:
Small organic molecule
Emp. Form.:
C15H18NO5P
Mol. Mass.:
323.2809
SMILES:
COP(=O)(OC)c1ccc(NCc2cc(O)ccc2O)cc1
: